Target
Lysophosphatidic acid receptor 1
Ligand
BDBM251675
Substrate
Meas. Tech.
Receptor Assay
Temperature
310.15±n/a K
IC50
6±n/a nM
Comments
extracted
Citation
 Buffham, WCanning, HDavenport, RFarnaby, WMack, SParmar, AWright, S Compounds US Patent  US9464060 Publication Date 10/11/2016 
Target
Name:
Lysophosphatidic acid receptor 1
Synonyms:
EDG2 LPA-1 LPAR1 Lysophosphatidic acid receptor 1 (LPA1) | Lysophosphatidic acid receptor Edg-2
Type:
Enzyme
Mol. Mass.:
41120.55
Organism:
Homo sapiens (Human)
Description:
Q92633
Residue:
364
  
Inhibitor
Name:
BDBM251675
Synonyms:
US10100018, Example 11 | US9464060, 11
Type:
Small organic molecule
Emp. Form.:
C28H22FNO4
Mol. Mass.:
455.477
SMILES:
OC(=O)c1ccc(CN(Cc2ccccc2)C(=O)c2ccc(Oc3ccccc3F)cc2)cc1
: