Target
Prothrombin
Ligand
BDBM163343
Substrate
Meas. Tech.
Thrombin Activity Assay
pH
7.4±n/a
Temperature
298.15±n/a K
IC50
<100±n/a nM
Comments
extracted
Citation
 Short, KMPham, SMWilliams, DCKita, DB Multisubstituted aromatic compounds as serine protease inhibitors US Patent  US9687479 Publication Date 6/27/2017 
Target
Name:
Prothrombin
Synonyms:
Activation peptide fragment 1 Coagulation factor II Prothrombin precursor Thrombin heavy chain | Thrombin light chain
Type:
Protein
Mol. Mass.:
70029.57
Organism:
Homo sapiens (Human)
Description:
P00734
Residue:
622
  
Inhibitor
Name:
BDBM163343
Synonyms:
US9687479, 245 3-1-[(2-chlorophenyl)carbonyl]-5-[(5-chlorothiophen-2-yl)methyl]amino-1H-pyrazol-3-yl-1-(pyridazin-3-ylmethyl)-1,2-dihydropyridin-2-one
Type:
Small Organic Molecule
Emp. Form.:
C25H18Cl2N6O2S
Mol. Mass.:
537.42
SMILES:
Clc1ccc(CNc2cc(nn2C(=O)c2ccccc2Cl)-c2cccn(Cc3cccnn3)c2=O)s1
: