Target
Leucine-rich repeat serine/threonine-protein kinase 2
Ligand
BDBM254940
Substrate
Meas. Tech.
Homogeneous Time Resolved-fluorescence Resonance Energy Transfer (TR-FRET) Assay
pH
8.5±n/a
Temperature
303.15±n/a K
IC50
215±n/a nM
Comments
extracted
Citation
 Bedford, STChen, IWang, YWilliamson, DS Arylpyrrolopyridine derived compounds as LRRK2 inhibitors US Patent  US9499542 Publication Date 11/22/2016 
Target
Name:
Leucine-rich repeat serine/threonine-protein kinase 2
Synonyms:
Dardarin LRRK2_HUMAN Leucine-rich repeat serine/threonine-protein kinase 2 PARK8
Type:
Protein
Mol. Mass.:
286113.20
Organism:
Homo sapiens (Human)
Description:
Q5S007
Residue:
2527
  
Inhibitor
Name:
BDBM254940
Synonyms:
US9499542, 23 | US9675594, 23
Type:
Small organic molecule
Emp. Form.:
C19H17N7
Mol. Mass.:
343.3852
SMILES:
Cc1cn(C)nc1Nc1cc(-c2ccnc(C)c2)c2c(c[nH]c2n1)C#N
: