Target
Melanin-concentrating hormone receptor 1 [E4Q,A5T]
Ligand
BDBM258831
Substrate
Meas. Tech.
Radioligand Binding Assay
pH
7.4±n/a
Ki
0.7±n/a nM
Comments
extracted
Citation
 Washburn, WNMurugaiah Subbaiah, MAAhmad, S Pyrrolone or pyrrolidinone melanin concentrating hormone receptor-1 antagonists US Patent  US9499482 Publication Date 11/22/2016 
Target
Name:
Melanin-concentrating hormone receptor 1 [E4Q,A5T]
Synonyms:
GPR24 MCHR1_HUMAN SLC1
Type:
Enzyme
Mol. Mass.:
46077.38
Organism:
Homo sapiens (Human)
Description:
Q99705 (E4Q, A5T)
Residue:
422
  
Inhibitor
Name:
BDBM258831
Synonyms:
US9499482, 266
Type:
Small organic molecule
Emp. Form.:
C26H26N4O2
Mol. Mass.:
426.5102
SMILES:
O=C1N(CC=C1Oc1ccc(cc1)C1CC1)c1ccc2n(CCN3CC=CC3)ncc2c1
: