Target
Phosphatidylinositol 3,4,5-trisphosphate 5-phosphatase 2
Ligand
BDBM50054267
Substrate
Meas. Tech.
Inhibition Assay
pH
7±n/a
IC50
4500±1400 nM
Comments
extracted
Citation
 Zhang, ZZeng, L Hydroxyindole carboxylic acid based inhibitors for oncogenic Src homology-2 domain containing protein tyrosine phosphatase-2 (SHP2) US Patent  US9522881 Publication Date 12/20/2016 
Target
Name:
Phosphatidylinositol 3,4,5-trisphosphate 5-phosphatase 2
Synonyms:
INPPL-1 Inositol polyphosphate phosphatase-like protein 1 Protein 51C SHIP-2 SHIP2_HUMAN | Src homology-2 domain containing protein tyrosine phosphatase-2 (SHP2)
Type:
Enzyme
Mol. Mass.:
138596.65
Organism:
Homo sapiens (Human)
Description:
O15357
Residue:
1258
  
Inhibitor
Name:
BDBM50054267
Synonyms:
CHEMBL3319386 | US9522881, 11c-4 (L88M52)
Type:
Small organic molecule
Emp. Form.:
C33H28IN3O6
Mol. Mass.:
689.4964
SMILES:
Cn1c(c(I)c2cc(C(O)=O)c(O)cc12)-c1cccc(NC(=O)CCC(=O)Nc2cccc(OCc3ccccc3)c2)c1
: