Target
5'-AMP-activated protein kinase catalytic subunit alpha-1/subunit beta-1/subunit gamma-1
Ligand
BDBM260437
Substrate
Meas. Tech.
In Vitro AMPK Activation Assay
pH
7.3±n/a
Temperature
298.15±n/a K
EC50
7±n/a nM
Comments
extracted
Citation
 Apgar, JMBiftu, TChen, PFeng, DHicks, JDKekec, ALeavitt, KJLi, BSebhat, IQian, XWei, LWilkening, RRWu, Z Benzimidazole tetrahydropyran derivatives US Patent  US9527839 Publication Date 12/27/2016 
Target
Name:
5'-AMP-activated protein kinase catalytic subunit alpha-1/subunit beta-1/subunit gamma-1
Synonyms:
5'-AMP-activated protein kinase Complex 1 AMP-activated protein kinase (AMPK) alpha-1/beta-1/gamma-1 AMPK complex 1 (alpha-1,beta-1,gamma-1) Recombinant AMPK alpha1/beta1/gamma1 complex
Type:
Mol. Mass.:
Description:
Components:
This complex has 0 components.
Component 1
Name:
5'-AMP-activated protein kinase subunit beta-1
Synonyms:
5'-AMP-activated protein kinase subunit beta-1 AMP-activated protein kinase alpha-2/beta-1/gamma-3 AMPK subunit beta-1 PRKAB1
Type:
Mol. Mass.:
30380.94
Organism:
Homo sapiens (Human)
Description:
Q9Y478
Residue:
270
  
Component 2
Name:
5'-AMP-activated protein kinase subunit gamma-1
Synonyms:
5'-AMP-activated protein kinase subunit gamma-1 AMP-activated protein kinase, gamma-1 subunit AMPK gamma-1 AMPK subunit gamma-1 PRKAG1
Type:
Mol. Mass.:
37581.44
Organism:
Homo sapiens (Human)
Description:
P54619
Residue:
331
  
Component 3
Name:
5'-AMP-activated protein kinase catalytic subunit alpha-1
Synonyms:
AAPK1_HUMAN AMP-activated protein kinase alpha-1/beta-2/gamma-2 AMPK subunit alpha-1 AMPK1 PRKAA1 | Tau-protein kinase PRKAA1
Type:
Protein
Mol. Mass.:
64023.62
Organism:
Homo sapiens (Human)
Description:
Q13131
Residue:
559
  
Inhibitor
Name:
BDBM260437
Synonyms:
US9527839, 26
Type:
Small organic molecule
Emp. Form.:
C26H24F2N2O6S
Mol. Mass.:
530.54
SMILES:
CS(=O)(=O)c1ccc(cc1)-c1ccc(cc1)-c1c(F)cc2[nH]c(O[C@H]3CO[C@H](CO)[C@@H](O)C3)nc2c1F
: