Target
5'-AMP-activated protein kinase catalytic subunit alpha-2
Ligand
BDBM327897
Substrate
Meas. Tech.
enzyme-linked immunosorbent assay
EC50
750±n/a nM
Citation
 Goff, DPayan, DSingh, RShaw, SCarroll, DHitoshi, Y AMPK-activating heterocyclic compounds and methods for using the same US Patent  US10377742 Publication Date 8/13/2019 
Target
Name:
5'-AMP-activated protein kinase catalytic subunit alpha-2
Synonyms:
AAPK2_HUMAN AMP-activated protein kinase, alpha-2 subunit AMPK subunit alpha-2 AMPK2 Hydroxymethylglutaryl-CoA reductase kinase | PRKAA2
Type:
Enzyme
Mol. Mass.:
62331.02
Organism:
Homo sapiens (Human)
Description:
P54646
Residue:
552
  
Inhibitor
Name:
BDBM327897
Synonyms:
(6-(4- (cyanobenzyl)piperidin- 4-ylamino)pyridin-3- yl)(4-(4- fluorobenzyl)piperazin- 1-yl)methanone US9663496, Compound 36
Type:
Small organic molecule
Emp. Form.:
C30H33FN6O
Mol. Mass.:
512.621
SMILES:
Fc1ccc(CN2CCN(CC2)C(=O)c2ccc(NC3CCN(Cc4ccc(cc4)C#N)CC3)nc2)cc1
: