Target
Replicase polyprotein 1ab
Ligand
BDBM50426071
Substrate
Meas. Tech.
high-throughput activity assay
IC50
21390±7060 nM
Citation
 Jin, ZDu, XXu, YDeng, YLiu, MZhao, YZhang, BLi, XZhang, LPeng, CDuan, YYu, JWang, LYang, KLiu, FJiang, RYang, XYou, TLiu, XYang, XBai, FLiu, HLiu, XGuddat, LWXu, WXiao, GQin, CShi, ZJiang, HRao, ZYang, H Structure of Mpro from SARS-CoV-2 and discovery of its inhibitors  Nature 582:289-293 (2020)  
Target
Name:
Replicase polyprotein 1ab
Synonyms:
ORF1ab polyprotein pp1ab | rep
Type:
Protein
Mol. Mass.:
794070.71
Organism:
2019-nCoV
Description:
P0DTD1
Residue:
7096
  
Inhibitor
Name:
BDBM50426071
Synonyms:
CHEMBL406050 US9018255, PX-12 | med.21724, Compound 156
Type:
Small organic molecule
Emp. Form.:
C7H12N2S2
Mol. Mass.:
188.314
SMILES:
CCC(C)SSc1ncc[nH]1
: