Target
Replicase polyprotein 1ab
Ligand
BDBM419126
Substrate
Meas. Tech.
FRET enzyme assay
IC50
230±50 nM
Citation
 Rathnayake, ADZheng, JKim, YPerera, KDMackin, SMeyerholz, DKKashipathy, MMBattaile, KPLovell, SPerlman, SGroutas, WCChang, KO 3C-like protease inhibitors block coronavirus replication in vitro and improve survival in MERS-CoV-infected mice. Sci Transl Med 12:0 (2020)  
Target
Name:
Replicase polyprotein 1ab
Synonyms:
ORF1ab polyprotein pp1ab | rep
Type:
Protein
Mol. Mass.:
794070.71
Organism:
2019-nCoV
Description:
P0DTD1
Residue:
7096
  
Inhibitor
Name:
BDBM419126
Synonyms:
3CLpro inhibitor 7c
Type:
Small organic molecule
Emp. Form.:
C23H39N3O5
Mol. Mass.:
437.5729
SMILES:
CCCC1CCC(CC1)OC(=O)N[C@H](CC(C)C)C(=O)N[C@H](CC1CCNC1=O)C=O
: