Target
Orf1a protein
Ligand
BDBM419128
Substrate
Meas. Tech.
FRET enzyme assay
IC50
130±60 nM
Citation
 Rathnayake, ADZheng, JKim, YPerera, KDMackin, SMeyerholz, DKKashipathy, MMBattaile, KPLovell, SPerlman, SGroutas, WCChang, KO 3C-like protease inhibitors block coronavirus replication in vitro and improve survival in MERS-CoV-infected mice. Sci Transl Med 12:0 (2020)  
Target
Name:
Orf1a protein
Synonyms:
3C-like proteinase Leader protein Non-structural protein 2 Non-structural protein 4 Non-structural protein 7 Non-structural protein 9 nsp5 | p65 homolog
Type:
Protein
Mol. Mass.:
486041.74
Organism:
MERS-CoV
Description:
A0A1L2E0X0
Residue:
4391
  
Inhibitor
Name:
BDBM419128
Synonyms:
3CLpro inhibitor 7e
Type:
Small organic molecule
Emp. Form.:
C24H41N3O5
Mol. Mass.:
451.5994
SMILES:
CCCCC1CCC(CC1)OC(=O)N[C@H](CC(C)C)C(=O)N[C@H](CC1CCNC1=O)C=O
: