Target
Nuclear receptor ROR-gamma
Ligand
BDBM419257
Substrate
Meas. Tech.
GAL4-RORgamma Transactivation
IC50
550±n/a nM
Citation
 Musicki, BBouix-Peter, COuvry, GThoreau, E Benzenesulfonamide derivatives as inverse agonists of retinoid-related orphan receptor gamma (RORγ(T)) US Patent  US10457637 Publication Date 10/29/2019 
Target
Name:
Nuclear receptor ROR-gamma
Synonyms:
NR1F3 Nuclear receptor ROR-gamma (RORC) RAR-related orphan receptor C (RORc) RORG RZRG Retinoid-related orphan receptor-gamma (RORc)
Type:
Enzyme Catalytic Domain
Mol. Mass.:
58218.40
Organism:
Homo sapiens (Human)
Description:
P51449
Residue:
518
  
Inhibitor
Name:
BDBM419257
Synonyms:
N-isopropyl-N-(4-methoxy- 2-methylphenyl)-3-(S- methylsulfonimidoyl)-4- ((tetrahydro-2H-pyran-4- yl)methoxy)benzene- sulfonamide | US10457637, Compound 143
Type:
Small organic molecule
Emp. Form.:
C24H34N2O6S2
Mol. Mass.:
510.667
SMILES:
COc1ccc(N(C(C)C)S(=O)(=O)c2ccc(OCC3CCOCC3)c(c2)S(C)(=N)=O)c(C)c1
: