Target
Replicase polyprotein 1ab
Ligand
BDBM420307
Substrate
Meas. Tech.
3CLpro enzyme assay
IC50
9200±n/a nM
Citation
 Zhu, WXu, MChen, CZGuo, HShen, MHu, XShinn, PKlumpp-Thomas, CMichael, SGZheng, W Identification of SARS-CoV-2 3CL Protease Inhibitors by a Quantitative High-throughput Screening. bioRxiv 0:0 (2020)  
Target
Name:
Replicase polyprotein 1ab
Synonyms:
ORF1ab polyprotein pp1ab | rep
Type:
Protein
Mol. Mass.:
794070.71
Organism:
2019-nCoV
Description:
P0DTD1
Residue:
7096
  
Inhibitor
Name:
BDBM420307
Synonyms:
CAY-10581
Type:
Small Organic Molecule
Emp. Form.:
C22H21NO4
Mol. Mass.:
363.4064
SMILES:
CC1(C)OC2=C(C(NCc3ccccc3)C1O)C(=O)c1ccccc1C2=O
: