Target
Toll-like receptor 7
Ligand
BDBM273463
Substrate
Meas. Tech.
Biological Assay
IC50
0.200±n/a nM
Citation
 Dyckman, AJDodd, DSMussari, CPPasunoori, LKumar, SR [1,2,4]triazolo[1,5-a]pyridinyl substituted indole compounds US Patent  US10478424 Publication Date 11/19/2019 
Target
Name:
Toll-like receptor 7
Synonyms:
ORF Names:UNQ248/PRO285 TLR7_HUMAN | Toll-like receptor 7 (TLR7)
Type:
Enzyme
Mol. Mass.:
120945.35
Organism:
Homo sapiens (Human)
Description:
Q9NYK1
Residue:
1049
  
Inhibitor
Name:
BDBM273463
Synonyms:
US10071079, Example 246 | US10478424, Example 246
Type:
Small organic molecule
Emp. Form.:
C28H37N5O
Mol. Mass.:
459.6263
SMILES:
CC(C)c1c([nH]c2ccc(cc12)C1CCN(CC(C)(C)O)CC1)-c1cc(C)c2nc(C)nn2c1
: