Target
Replicase polyprotein 1ab
Ligand
BDBM420363
Substrate
Meas. Tech.
IC50 Determination
IC50
3500±400 nM
Citation
 St. John, SEMesecar, AD Broad-spectrum non-covalent coronavirus protease inhibitors US Patent  US9975885 Publication Date 5/22/2018 
Target
Name:
Replicase polyprotein 1ab
Synonyms:
3C-like proteinase 3C-like proteinase (SARS-CoV 3Cpro) 3CLp GFL Guanine-N7 methyltransferase Helicase Leader protein Non-structural protein 10 Non-structural protein 3 Non-structural protein 6 Non-structural protein 8 ORF1ab polyprotein PL2-PRO Pol R1AB_SARS RdRp SARS coronavirus main proteinase nsp1 nsp12 nsp14 nsp16 nsp3 nsp5 nsp7 nsp9 pp1ab | rep
Type:
Protein
Mol. Mass.:
790250.81
Organism:
Human SARS coronavirus (SARS-CoV) (Severe acute respiratory syndrome coronavirus)
Description:
P0C6X7
Residue:
7073
  
Inhibitor
Name:
BDBM420363
Synonyms:
US9975885, Compound 14
Type:
Small organic molecule
Emp. Form.:
C34H34N6O4
Mol. Mass.:
590.6716
SMILES:
COc1cccc(c1)C(N(C(=O)Cn1nnc2ccccc12)c1ccc(NC(=O)C(C)C)cc1)C(=O)NCc1ccccc1
: