Target
Replicase polyprotein 1ab
Ligand
BDBM420979
Substrate
Meas. Tech.
IC50 Determination
IC50
7400±1100 nM
Citation
 St. John, SEMesecar, AD Broad-spectrum non-covalent coronavirus protease inhibitors US Patent  US9975885 Publication Date 5/22/2018 
Target
Name:
Replicase polyprotein 1ab
Synonyms:
ORF1ab polyprotein pp1ab | rep
Type:
Protein
Mol. Mass.:
805759.07
Organism:
HCoV-HKU1
Description:
P0C6X4
Residue:
7132
  
Inhibitor
Name:
BDBM420979
Synonyms:
US9975885, Compound 34
Type:
Small organic molecule
Emp. Form.:
C30H27N7O3S
Mol. Mass.:
565.645
SMILES:
O=C(Cn1nnc2ccccc12)N(C(C(=O)NCc1cccnc1)c1ccsc1)c1ccc(NC(=O)C2CC2)cc1
: