Target
Ectonucleotide pyrophosphatase/phosphodiesterase family member 2
Ligand
BDBM191784
Substrate
Meas. Tech.
In Vitro Assays
IC50
50±n/a nM
Citation
 Desroy, NHeckmann, BBrys, RCJoncour, AMPeixoto, CBock, XM Compounds and pharmaceutical compositions thereof for the treatment of inflammatory disorders US Patent  US10526329 Publication Date 1/7/2020 
Target
Name:
Ectonucleotide pyrophosphatase/phosphodiesterase family member 2
Synonyms:
ATX Autotaxin (ATX) ENPP2 Ectonucleotide Pyrophosphatase/Phosphodiesterase 2 (ENPP2) Extracellular lysophospholipase D PDNP2
Type:
Enzyme
Mol. Mass.:
99007.13
Organism:
Homo sapiens (Human)
Description:
Q13822
Residue:
863
  
Inhibitor
Name:
BDBM191784
Synonyms:
US10526329, Compound 30 US9670204, 30 1-(azetidin-1-yl)-2-(4-(2-ethyl-3-((4-(4-fluorophenyl)thiazol-2-yl)(methyl)amino)imidazo[1,2-a]pyridin-6yl)piperazin-1-yl)ethanone
Type:
Small organic molecule
Emp. Form.:
C28H32FN7OS
Mol. Mass.:
533.663
SMILES:
CCc1nc2ccc(cn2c1N(C)c1nc(cs1)-c1ccc(F)cc1)N1CCN(CC(=O)N2CCC2)CC1
: