Target
Ectonucleotide pyrophosphatase/phosphodiesterase family member 2
Ligand
BDBM192363
Substrate
IC50
50±n/a nM
Citation
 Desroy, NHeckmann, BBrys, RCJoncour, AMPeixoto, CBock, XM Compounds and pharmaceutical compositions thereof for the treatment of inflammatory disorders US Patent  US10526329 Publication Date 1/7/2020 
Target
Name:
Ectonucleotide pyrophosphatase/phosphodiesterase family member 2
Synonyms:
ATX Autotaxin (ATX) ENPP2 Ectonucleotide Pyrophosphatase/Phosphodiesterase 2 (ENPP2) Extracellular lysophospholipase D PDNP2
Type:
Enzyme
Mol. Mass.:
99007.13
Organism:
Homo sapiens (Human)
Description:
Q13822
Residue:
863
  
Inhibitor
Name:
BDBM192363
Synonyms:
US10526329, Compound 108 US9670204, 108 ethyl2-(4-(2-ethyl-3-((4-(4-fluorophenyl)thiazol-2-yl)(methyl)amino)imidazo[1,2-a]pyridin-6-yl)-5,6-dihydropyridin-1(2H)-yl)acetate
Type:
Small organic molecule
Emp. Form.:
C28H30FN5O2S
Mol. Mass.:
519.634
SMILES:
CCOC(=O)CN1CCC(=CC1)c1ccc2nc(CC)c(N(C)c3nc(cs3)-c3ccc(F)cc3)n2c1
: