Target
Toll-like receptor 8
Ligand
BDBM428547
Substrate
Meas. Tech.
TLR7/8/9 Inhibition Reporter Assays
IC50
0.120±n/a nM
Citation
 Dyckman, AJDodd, DSMussari, CPKumar, SR 4-azaindole compounds US Patent  US10544143 Publication Date 1/28/2020 
Target
Name:
Toll-like receptor 8
Synonyms:
CD_antigen: CD288 TLR8_HUMAN | TRL8
Type:
Enzyme
Mol. Mass.:
119828.77
Organism:
Homo sapiens (Human)
Description:
Q9NR97
Residue:
1041
  
Inhibitor
Name:
BDBM428547
Synonyms:
US10544143, Example 983 US11053244, Example 983
Type:
Small organic molecule
Emp. Form.:
C25H33N7
Mol. Mass.:
431.5764
SMILES:
CC(C)[C@H]1CN(CCN1)c1ccc2[nH]c(c(C(C)C)c2n1)-c1cn2ncnc2c(C)c1C
: