Target
Replicase polyprotein 1ab
Ligand
BDBM11262
Substrate
Meas. Tech.
No assay is provided
IC50
10000±n/a nM
Citation
 Pillaiyar, TManickam, MNamasivayam, VHayashi, YJung, SH An Overview of Severe Acute Respiratory Syndrome-Coronavirus (SARS-CoV) 3CL Protease Inhibitors: Peptidomimetics and Small Molecule Chemotherapy. J Med Chem 59:6595-628 (2016)  
Target
Name:
Replicase polyprotein 1ab
Synonyms:
3C-like proteinase 3C-like proteinase (SARS-CoV 3Cpro) 3CLp GFL Guanine-N7 methyltransferase Helicase Leader protein Non-structural protein 10 Non-structural protein 3 Non-structural protein 6 Non-structural protein 8 ORF1ab polyprotein PL2-PRO Pol R1AB_SARS RdRp SARS coronavirus main proteinase nsp1 nsp12 nsp14 nsp16 nsp3 nsp5 nsp7 nsp9 pp1ab | rep
Type:
Protein
Mol. Mass.:
790250.81
Organism:
Human SARS coronavirus (SARS-CoV) (Severe acute respiratory syndrome coronavirus)
Description:
P0C6X7
Residue:
7073
  
Inhibitor
Name:
BDBM11262
Synonyms:
dipeptidomimetic unsaturated ester 18d ethyl (2E,4S)-4-[(2S)-2-[(2E)-3-(2,4-dimethoxyphenyl)prop-2-enamido]-3-phenylpropanamido]-5-phenylpent-2-enoate | jm5b01461, Compound 9
Type:
Small organic molecule
Emp. Form.:
C33H36N2O6
Mol. Mass.:
556.6487
SMILES:
CCOC(=O)\C=C\[C@H](Cc1ccccc1)NC(=O)[C@H](Cc1ccccc1)NC(=O)\C=C\c1ccc(OC)cc1OC
: