Target
Replicase polyprotein 1ab
Ligand
BDBM430669
Substrate
Meas. Tech.
DRC analysis by immunofluorescence
IC50
7280±n/a nM
Citation
 Jeon, SKo, MLee, JChoi, IByun, SYPark, SShum, DKim, S Identification of Antiviral Drug Candidates against SARS-CoV-2 from FDA-Approved Drugs. Antimicrob Agents Chemother 64:0 (2020)  
Target
Name:
Replicase polyprotein 1ab
Synonyms:
ORF1ab polyprotein pp1ab | rep
Type:
Protein
Mol. Mass.:
794070.71
Organism:
2019-nCoV
Description:
P0DTD1
Residue:
7096
  
Inhibitor
Name:
BDBM430669
Synonyms:
Mequitazine
Type:
Small Organic Molecule
Emp. Form.:
C20H22N2S
Mol. Mass.:
322.467
SMILES:
C(C1CN2CCC1CC2)N1c2ccccc2Sc2ccccc12
: