Target
Dimer of Gag-Pol polyprotein [489-587]
Ligand
BDBM1676
Substrate
Fluorescent peptide substrate
Meas. Tech.
Protease Inhibition Assay
pH
5.5±n/a
Temperature
310.15±n/a K
Ki
3.4±n/a nM
Citation
 Nugiel, DAJacobs, KCornelius, LChang, CHJadhav, PKHoller, ERKlabe, RMBacheler, LTCordova, BGarber, SReid, CLogue, KAGorey-Feret, LJLam, GNErickson-Viitanen, SSeitz, SP Improved P1/P1' substituents for cyclic urea based HIV-1 protease inhibitors: synthesis, structure-activity relationship, and X-ray crystal structure analysis. J Med Chem 40:1465-74 (1997)  
Target
Name:
Dimer of Gag-Pol polyprotein [489-587]
Synonyms:
HIV-1 Protease
Type:
Protein Complex
Mol. Mass.:
Description:
Components:
This complex has 2 components.
Component 1
Name:
Gag-Pol polyprotein [489-587]
Synonyms:
HIV protease HIV-1 Protease chain A POL_HV1N5 | gag-pol
Type:
Enzyme Subunit
Mol. Mass.:
10822.21
Organism:
Human immunodeficiency virus type 1
Description:
P12497[489-587]
Residue:
99
  
Component 2
Name:
Gag-Pol polyprotein [489-587]
Synonyms:
HIV protease HIV-1 Protease chain A POL_HV1N5 | gag-pol
Type:
Enzyme Subunit
Mol. Mass.:
10822.21
Organism:
Human immunodeficiency virus type 1
Description:
P12497[489-587]
Residue:
99
  
Inhibitor
Name:
BDBM1676
Synonyms:
(4R,5S,6S,7R)-1,3,4,7-tetrabenzyl-5,6-dihydroxy-1,3-diazepan-2-one Cyclic Urea Based HIV-1 Protease Inhibitor 1 (parent)
Type:
Small organic molecule
Emp. Form.:
C33H34N2O3
Mol. Mass.:
506.6347
SMILES:
O[C@@H]1[C@@H](O)[C@@H](Cc2ccccc2)N(Cc2ccccc2)C(=O)N(Cc2ccccc2)[C@@H]1Cc1ccccc1
:
Substrate
Name:
Fluorescent peptide substrate
Synonyms:
Type:
Peptide
Mol. Mass.:
4608.75
Organism:
Description:
Residue:
42