Target
Sigma intracellular receptor 2
Ligand
BDBM349368
Substrate
Meas. Tech.
Competitive Radioligand Binding Assay
Ki
0.440±n/a nM
Citation
 Rishton, GMCatalano, SMLook, GC Isoindoline compositions and methods for treating neurodegenerative disease US Patent  US10611728 Publication Date 4/7/2020 
Target
Name:
Sigma intracellular receptor 2
Synonyms:
MAC30 S2R Sigma-2 receptor TMEM97 | Transmembrane protein 97
Type:
Protein
Mol. Mass.:
20857.20
Organism:
Homo sapiens (Human)
Description:
Q5BJF2
Residue:
176
  
Inhibitor
Name:
BDBM349368
Synonyms:
US10207991, Ex. Cpd. No. 11 US11691947, Example 11
Type:
Small organic molecule
Emp. Form.:
C20H23Cl2NO2
Mol. Mass.:
380.308
SMILES:
COc1cc2CN(Cc2cc1OC)[C@H](C)CCc1ccc(Cl)c(Cl)c1
: