Target
Neurotensin receptor type 1
Ligand
BDBM297519
Substrate
Meas. Tech.
NTR1 Ca2+ Flux Dose Response
EC50
>10000±n/a nM
Citation
 Pinkerton, ABHershberger, PMPeddibhotla, SMaloney, PRHedrick, MP Small molecule agonists of neurotensin receptor 1 US Patent  US10118902 Publication Date 11/6/2018 
Target
Name:
Neurotensin receptor type 1
Synonyms:
Dopamine receptor D2L/neurotensin receptor NTS1 NTRR Neurotensin receptor 1 | neurotensin receptor type 1
Type:
PROTEIN
Mol. Mass.:
46278.89
Organism:
Homo sapiens (Human)
Description:
ChEMBL_1453811
Residue:
418
  
Inhibitor
Name:
BDBM297519
Synonyms:
US10118902, Example 21 {4-[4-(2-methoxy-phenyl)- piperidin-1-yl]-2-[1-(methyl- propyl-amino)-cyclopropyl]- quinazolin-6-yl}-methyl-propyl- amine
Type:
Small organic molecule
Emp. Form.:
C31H43N5O
Mol. Mass.:
501.706
SMILES:
CCCN(C)c1ccc2nc(nc(N3CCC(CC3)c3ccccc3OC)c2c1)C1(CC1)N(C)CCC
: