Target
Replicase polyprotein 1ab
Ligand
BDBM442755
Substrate
Meas. Tech.
fluorescent peptide assay
Ki
32±2.00 nM
IC50
33±2.00 nM
Citation
 Yang, KSMa, XRMa, YAlugubelli, YRScott, DAVatansever, ECDrelich, AKSankaran, BGeng, ZZBlankenship, LRWard, HESheng, YJHsu, JCKratch, KCZhao, BHayatshahi, HSLiu, JLi, PFierke, CATseng, CKXu, SLiu, WR A Quick Route to Multiple Highly Potent SARS-CoV-2 Main Protease Inhibitors ChemMedChem 0:0 (2020)  
Target
Name:
Replicase polyprotein 1ab
Synonyms:
ORF1ab polyprotein pp1ab | rep
Type:
Protein
Mol. Mass.:
794070.71
Organism:
2019-nCoV
Description:
P0DTD1
Residue:
7096
  
Inhibitor
Name:
BDBM442755
Synonyms:
MPI5
Type:
Small organic molecule
Emp. Form.:
C29H42N4O6
Mol. Mass.:
542.667
SMILES:
CC(C)[C@H](NC(=O)OCc1ccccc1)C(=O)N[C@@H](CC1CCCCC1)C(=O)N[C@@H](C[C@@H]1CCNC1=O)C=O
: