Target
Replicase polyprotein 1ab
Ligand
BDBM442762
Substrate
Meas. Tech.
fluorescent peptide assay
Ki
59±3.90 nM
IC50
60±4.00 nM
Citation
 Yang, KSMa, XRMa, YAlugubelli, YRScott, DAVatansever, ECDrelich, AKSankaran, BGeng, ZZBlankenship, LRWard, HESheng, YJHsu, JCKratch, KCZhao, BHayatshahi, HSLiu, JLi, PFierke, CATseng, CKXu, SLiu, WR A Quick Route to Multiple Highly Potent SARS-CoV-2 Main Protease Inhibitors ChemMedChem 0:0 (2020)  
Target
Name:
Replicase polyprotein 1ab
Synonyms:
ORF1ab polyprotein pp1ab | rep
Type:
Protein
Mol. Mass.:
794070.71
Organism:
2019-nCoV
Description:
P0DTD1
Residue:
7096
  
Inhibitor
Name:
BDBM442762
Synonyms:
MPI6
Type:
Small organic molecule
Emp. Form.:
C29H44N4O7
Mol. Mass.:
560.6823
SMILES:
CC(C)C[C@H](NC(=O)[C@@H](NC(=O)OCc1ccccc1)C(C)OC(C)(C)C)C(=O)N[C@@H](C[C@@H]1CCNC1=O)C=O
: