Target
Replicase polyprotein 1ab
Ligand
BDBM50399407
Substrate
Meas. Tech.
Antiviral activity assays
EC50
38240±0.0 nM
Citation
 Günther, SReinke, PYFernández-García, YLieske, JLane, TJGinn, HMKoua, FHEhrt, CEwert, WOberthuer, DYefanov, OMeier, SLorenzen, KKrichel, BKopicki, JGelisio, LBrehm, WDunkel, ISeychell, BGieseler, HNorton-Baker, BEscudero-Pérez, BDomaracky, MSaouane, STolstikova, AWhite, TAHänle, AGroessler, MFleckenstein, HTrost, FGalchenkova, MGevorkov, YLi, CAwel, SPeck, ABarthelmess, MSchlünzen, FXavier, PLWerner, NAndaleeb, HUllah, NFalke, SSrinivasan, VFranca, BASchwinzer, MBrognaro, HRogers, CMelo, DZaitsev-Doyle, JJKnoska, JPeña Murillo, GEMashhour, ARGuicking, FHennicke, VFischer, PHakanpää, JMeyer, JGribbon, PEllinger, BKuzikov, MWolf, MBeccari, ARBourenkov, GStetten, DPompidor, GBento, IPanneerselvam, SKarpics, ISchneider, TRGarcia Alai, MMNiebling, SGünther, CSchmidt, CSchubert, RHan, HBoger, JMonteiro, DCZhang, LSun, XPletzer-Zelgert, JWollenhaupt, JFeiler, CGWeiss, MSSchulz, EMehrabi, PKarničar, KUsenik, ALoboda, JTidow, HChari, AHilgenfeld, RUetrecht, CCox, RZaliani, ABeck, TRarey, MGünther, STurk, DHinrichs, WChapman, HNPearson, ARBetzel, CMeents, A Inhibition of SARS-CoV-2 main protease by allosteric drug-binding bioRxiv 2020:0 (2020)    Article 
Target
Name:
Replicase polyprotein 1ab
Synonyms:
ORF1ab polyprotein pp1ab | rep
Type:
Protein
Mol. Mass.:
794070.71
Organism:
2019-nCoV
Description:
P0DTD1
Residue:
7096
  
Inhibitor
Name:
BDBM50399407
Synonyms:
CHEMBL2178284 | MUT056399
Type:
Small organic molecule
Emp. Form.:
C15H13F2NO3
Mol. Mass.:
293.2654
SMILES:
CCc1cc(O)c(Oc2ccc(cc2F)C(N)=O)cc1F
: