Target
Replicase polyprotein 1ab
Ligand
BDBM50282865
Substrate
Meas. Tech.
Hit profiling assay without DTT
IC50
>20000±n/a nM
Citation
 Kuzikov, MCostanzi, EReinshagen, JEsposito, FVangeel, LWolf, MEllinger, BClaussen, CGeisslinger, GCorona, AIaconis, DTalarico, CManelfi, CCannalire, RRossetti, GGossen, JAlbani, SMusiani, FHerzog, KYe, YGiabbai, BDemitri, NJochmans, DDe Jonghe, SRymenants, JSumma, VTramontano, EBeccari, ARLeyssen, PStorici, PNeyts, JGribbon, PZaliani, A Identification of inhibitors of SARS-CoV-2 3CL-Pro enzymatic activity using a small molecule in-vitro repurposing screen bioRxiv 2020:0 (2020)    Article 
Target
Name:
Replicase polyprotein 1ab
Synonyms:
ORF1ab polyprotein pp1ab | rep
Type:
Protein
Mol. Mass.:
794070.71
Organism:
2019-nCoV
Description:
P0DTD1
Residue:
7096
  
Inhibitor
Name:
BDBM50282865
Synonyms:
2-Chloromethyl-1,1-dioxo-1,2-dihydro-1lambda*6*-benzo[d]isothiazol-3-one PD120339
Type:
Small organic molecule
Emp. Form.:
C8H6ClNO3S
Mol. Mass.:
231.656
SMILES:
ClCN1C(=O)c2ccccc2S1(=O)=O
: