Target
Genome polyprotein
Ligand
BDBM298546
Substrate
Meas. Tech.
HCV Replicon Luciferase Assay
EC50
>1000±n/a nM
Citation
 Wang, TYin, ZZhang, ZKadow, JF Benzofuran compounds for the treatment of hepatitis C US Patent  US10125111 Publication Date 11/13/2018 
Target
Name:
Genome polyprotein
Synonyms:
Genome polyprotein RNA polymerase (NS5B)
Type:
Enzyme
Mol. Mass.:
326966.11
Organism:
Hepatitis C virus (HCV)
Description:
Q9WMX2
Residue:
3010
  
Inhibitor
Name:
BDBM298546
Synonyms:
US10125111, Compound 4002
Type:
Small organic molecule
Emp. Form.:
C27H24F2N2O6S
Mol. Mass.:
542.551
SMILES:
CNC(=O)c1c(oc2cc(N(CCCF)S(C)(=O)=O)c(cc12)-c1cccc(c1)C(O)=O)-c1ccc(F)cc1
: