Target
Serine/threonine-protein kinase B-raf [V600E]
Ligand
BDBM87916
Substrate
Meas. Tech.
In Vitro Activity Assay
IC50
1.35±n/a nM
Citation
 Aversa, RJBarsanti, PABurger, MTDillon, MPDipesa, AHu, CLou, YNishiguchi, GAPan, YPolyakov, VRRamurthy, SRico, ACSetti, LQSmith, ASubramanian, STaft, BRTanner, HRWan, LYusuff, N Biaryl amide compounds as kinase inhibitors US Patent  US10709712 Publication Date 7/14/2020 
Target
Name:
Serine/threonine-protein kinase B-raf [V600E]
Synonyms:
B-RAF V600E B-Raf Protein Kinase Mutant (V600E) BRAF BRAF mutant V600E BRAF_HUMAN Protein mono-ADP-ribosyltransferase (PARP3) RAFB1 Serine/threonine-protein kinase B-raf (V600E) V-RAF murine sarcoma viral oncogene homologue B1 mutant (BRAF V600E)
Type:
Mol. Mass.:
84474.98
Organism:
Homo sapiens (Human)
Description:
P15056 V600E
Residue:
766
  
Inhibitor
Name:
BDBM87916
Synonyms:
US10245267, Example 945 US9694016, 945
Type:
Small organic molecule
Emp. Form.:
C27H30F2N4O3
Mol. Mass.:
496.5489
SMILES:
CC(C)Oc1ncc(cc1N1CCOCC1)-c1cc(NC(=O)c2ccnc(c2)C(C)(F)F)ccc1C
: