Target
RAF proto-oncogene serine/threonine-protein kinase
Ligand
BDBM88056
Substrate
Meas. Tech.
In Vitro Activity Assay
IC50
12.7±n/a nM
Citation
 Aversa, RJBarsanti, PABurger, MTDillon, MPDipesa, AHu, CLou, YNishiguchi, GAPan, YPolyakov, VRRamurthy, SRico, ACSetti, LQSmith, ASubramanian, STaft, BRTanner, HRWan, LYusuff, N Biaryl amide compounds as kinase inhibitors US Patent  US10709712 Publication Date 7/14/2020 
Target
Name:
RAF proto-oncogene serine/threonine-protein kinase
Synonyms:
C-Raf Protein Kinase RAF RAF1 Raf-1 Serine/threonine-protein kinase C-Raf | cRaf
Type:
Serine/threonine-protein kinase
Mol. Mass.:
73082.52
Organism:
Homo sapiens (Human)
Description:
P04049
Residue:
648
  
Inhibitor
Name:
BDBM88056
Synonyms:
US10245267, Example 1090 US9694016, 1090
Type:
Small organic molecule
Emp. Form.:
C25H28N6O5S
Mol. Mass.:
524.592
SMILES:
Cc1ncc(NC(=O)c2ccnc(c2)S(C)(=O)=O)cc1-c1cc(nc(c1)N1CCOCC1)N1CC(O)C1
: