Target
Advanced glycosylation end product-specific receptor
Ligand
BDBM50249574
Substrate
Meas. Tech.
High-Throughput Screening Assay
Kd
1.10±0.2 nM
Citation
 Schmidt, AMRamasamy, RShekhtman, ARai, VManigrasso, MB Amino, amido and heterocyclic compounds as modulators of RAGE activity and uses thereof US Patent  US10729695 Publication Date 8/4/2020 
Target
Name:
Advanced glycosylation end product-specific receptor
Synonyms:
AGER RAGE_HUMAN | Receptor for advanced glycosylation end products
Type:
PROTEIN
Mol. Mass.:
42800.11
Organism:
Homo sapiens (Human)
Description:
ChEMBL_1339877
Residue:
404
  
Inhibitor
Name:
BDBM50249574
Synonyms:
CHEMBL4077165 | US10729695, Compound CB-5
Type:
Small organic molecule
Emp. Form.:
C15H10F2N2OS
Mol. Mass.:
304.315
SMILES:
Oc1cccc(Nc2nc(cs2)-c2ccc(F)cc2F)c1
: