Target
Glycogen synthase kinase-3 beta
Ligand
BDBM7335
Substrate
GSK-3 Peptide Substrate
Meas. Tech.
Kinase Inhibition Assay
Temperature
303.15±n/a K
IC50
30±n/a nM
Comments
extracted
Citation
 Kunick, CLauenroth, KWieking, KXie, XSchultz, CGussio, RZaharevitz, DLeost, MMeijer, LWeber, AJorgensen, FSLemcke, T Evaluation and comparison of 3D-QSAR CoMSIA models for CDK1, CDK5, and GSK-3 inhibition by paullones. J Med Chem 47:22-36 (2004)  
Target
Name:
Glycogen synthase kinase-3 beta
Synonyms:
GSK-3, beta Glycogen Synthase Kinase-3, beta | Gsk3b
Type:
Enzyme
Mol. Mass.:
46754.43
Organism:
Rattus norvegicus (rat)
Description:
The rat GSK-3 beta cDNA was inserted into the baculovirus vector. The protein was purified from virus-infected sf9 insect cells
Residue:
420
  
Inhibitor
Name:
BDBM7335
Synonyms:
5-(4-aminobutoxy)-14-bromo-8,18-diazatetracyclo[9.7.0.0^{2,7}.0^{12,17}]octadeca-1(11),2,4,6,12(17),13,15-heptaen-9-one hydrochloride Paullone Analogue 70
Type:
Small organic molecule
Emp. Form.:
C20H20BrN3O2
Mol. Mass.:
414.296
SMILES:
NCCCCOc1ccc2-c3[nH]c4ccc(Br)cc4c3CC(=O)Nc2c1
:
Substrate
Name:
GSK-3 Peptide Substrate
Synonyms:
GS-1 Peptide | Phospho-GS2 Substrate Peptide
Type:
Peptide
Mol. Mass.:
3045.17
Organism:
Description:
Residue:
27