Target
5-hydroxytryptamine receptor 1A
Ligand
BDBM458557
Substrate
Meas. Tech.
Binding Activity Assay
Ki
0.080±n/a nM
Citation
 Yoshinaga, HIkuma, YIkeda, JAdachi, SMitsunuma, HAihara, YBesnard, JBell, AS Condensed lactam derivative US Patent  US10745401 Publication Date 8/18/2020 
Target
Name:
5-hydroxytryptamine receptor 1A
Synonyms:
5-HT-1A 5-hydroxytryptamine receptor 1A (5-HT-1A) ADRB2RL1 Dopamine D2 receptor and serotonin 1a receptor HTR1A | Serotonin receptor 1A
Type:
Mol. Mass.:
46122.49
Organism:
Homo sapiens (Human)
Description:
Residue:
422
  
Inhibitor
Name:
BDBM458557
Synonyms:
US10745401, Example 31 | US11466007, Example 31
Type:
Small organic molecule
Emp. Form.:
C22H27N5OS
Mol. Mass.:
409.548
SMILES:
Cn1ncc2c1CCCC(CCN1CCN(CC1)c1nsc3ccccc13)C2=O
: