Target
Cyclin-dependent kinase 6/G1/S-specific cyclin-D1
Ligand
BDBM370229
Substrate
Meas. Tech.
CDK6/Cyclin D1 Mobility Shift Assay
Ki
0.210±n/a nM
Citation
 Behenna, DCChen, PFreeman-Cook, KDHoffman, RLJalaie, MNagata, ANair, SKNinkovic, SOrnelas, MAPalmer, CLRui, EY CDK2/4/6 inhibitors US Patent  US10800783 Publication Date 10/13/2020 
Target
Name:
Cyclin-dependent kinase 6/G1/S-specific cyclin-D1
Synonyms:
CDK6/Cyclin D1
Type:
Enzyme
Mol. Mass.:
Description:
Components:
This complex has 2 components.
Component 1
Name:
Cyclin-dependent kinase 6
Synonyms:
CDK6 CDKN6 Cyclin-dependent kinase 6 (CDK 6) | Serine/threonine-protein kinase PLSTIRE
Type:
Enzyme Subunit
Mol. Mass.:
36937.42
Organism:
Homo sapiens (Human)
Description:
Q00534
Residue:
326
  
Component 2
Name:
G1/S-specific cyclin-D1
Synonyms:
CCND1_MOUSE Cyclin D1 | Cyl-1
Type:
Enzyme Subunit
Mol. Mass.:
33418.84
Organism:
Mus musculus (mouse)
Description:
Residue:
295
  
Inhibitor
Name:
BDBM370229
Synonyms:
US10233188, Example 116 US11396512, Example 116
Type:
Small organic molecule
Emp. Form.:
C23H33N5O4S
Mol. Mass.:
475.604
SMILES:
Cc1cc2cnc(NC3CCN(CC3)S(=O)(=O)CC3CC3)nc2n([C@@H]2CCC[C@@]2(C)O)c1=O
: