Target
Structural polyprotein
Ligand
BDBM476324
Substrate
Meas. Tech.
CPE Assay
EC50
>78000±n/a nM
Citation
 Painter, GRGuthrie, DBBluemling, GRNatchus, MR N4-hydroxycytidine and derivatives and anti-viral uses related thereto US Patent  US10874683 Publication Date 12/29/2020 
Target
Name:
Structural polyprotein
Synonyms:
POLS_CHIKS | p130
Type:
Protein
Mol. Mass.:
138165.86
Organism:
CHIKV
Description:
Q8JUX5
Residue:
1248
  
Inhibitor
Name:
BDBM476324
Synonyms:
US10874683, Example EIDD-02504-01
Type:
Small organic molecule
Emp. Form.:
C4H5N3O2
Mol. Mass.:
127.1014
SMILES:
ONc1cc[nH]c(=O)n1
: