Target
Structural polyprotein
Ligand
BDBM476332
Substrate
Meas. Tech.
CPE Assay
EC50
56000±n/a nM
Citation
 Painter, GRGuthrie, DBBluemling, GRNatchus, MR N4-hydroxycytidine and derivatives and anti-viral uses related thereto US Patent  US10874683 Publication Date 12/29/2020 
Target
Name:
Structural polyprotein
Synonyms:
POLS_CHIKS | p130
Type:
Protein
Mol. Mass.:
138165.86
Organism:
CHIKV
Description:
Q8JUX5
Residue:
1248
  
Inhibitor
Name:
BDBM476332
Synonyms:
US10874683, Example EIDD-02110-03
Type:
Small organic molecule
Emp. Form.:
C21H32N5O13P
Mol. Mass.:
593.4782
SMILES:
CC(C)(C)C(=O)OCOP(=O)(OCOC(=O)C(C)(C)C)OC[C@]1(O[C@H](C(O)[C@H]1O)n1ccc(=O)[nH]c1=O)N=[N+]=[N-]
: