Target
Replicase polyprotein 1ab
Ligand
BDBM476338
Substrate
Meas. Tech.
Activity of Compound 1A and 1B Against Coronavirus in BHK-21
EC50
2500±n/a nM
Citation
 Sommadossi, JMoussa, A Highly active compounds against COVID-19 US Patent  US10874687 Publication Date 12/29/2020 
Target
Name:
Replicase polyprotein 1ab
Synonyms:
ORF1ab polyprotein pp1ab | rep
Type:
Protein
Mol. Mass.:
754187.17
Organism:
HCoV-229E
Description:
P0C6X1
Residue:
6758
  
Inhibitor
Name:
BDBM476338
Synonyms:
US10874687, Compound 1B
Type:
Small organic molecule
Emp. Form.:
C24H33FN7O7P
Mol. Mass.:
581.5337
SMILES:
CNc1nc(N)nc2n(cnc12)[C@@H]1O[C@H](CO[P@](=O)(N[C@@H](C)C(=O)OC(C)C)Oc2ccccc2)[C@@H](O)[C@@]1(C)F
: