Target
TSC22 domain family protein 3
Ligand
BDBM476577
Substrate
Meas. Tech.
GILZ gene assays
IC50
1.99±n/a nM
Citation
 Garbaccio, RMKern, JCMulhearn, JJBrandish, PE Phosphonate linkers and their use to facilitate cellular retention of compounds US Patent  US10869929 Publication Date 12/22/2020 
Target
Name:
TSC22 domain family protein 3
Synonyms:
DSIP-immunoreactive peptide Delta sleep-inducing peptide immunoreactor Glucocorticoid-induced leucine zipper protein T22D3_HUMAN TSC-22-related protein TSC22D3 | hDIP
Type:
Protein
Mol. Mass.:
14799.51
Organism:
Human
Description:
Q99576
Residue:
134
  
Inhibitor
Name:
BDBM476577
Synonyms:
US10869929, Compound 10 | US11554172, Compound 10
Type:
Small organic molecule
Emp. Form.:
C27H39F2O7PS
Mol. Mass.:
576.63
SMILES:
C[C@@H]1C[C@H]2[C@@H]3C[C@H](F)C4=CC(=O)C=C[C@]4(C)[C@@]3(F)[C@@H](O)C[C@]2(C)[C@@]1(O)C(=O)SCCCCCCP(O)(O)=O
: