Target
Replicase polyprotein 1ab
Ligand
BDBM476944
Substrate
Meas. Tech.
Enzyme Assays and Inhibition Studies
IC50
310±30 nM
Citation
 Dampalla, CSKim, YBickmeier, NRathnayake, ADNguyen, HNZheng, JKashipathy, MMBaird, MABattaile, KPLovell, SPerlman, SChang, KOGroutas, WC Structure-Guided Design of Conformationally Constrained Cyclohexane Inhibitors of Severe Acute Respiratory Syndrome Coronavirus-2 3CL Protease. J Med Chem 64:10047-10058 (2021)  
Target
Name:
Replicase polyprotein 1ab
Synonyms:
ORF1ab polyprotein pp1ab | rep
Type:
Protein
Mol. Mass.:
794070.71
Organism:
2019-nCoV
Description:
P0DTD1
Residue:
7096
  
Inhibitor
Name:
BDBM476944
Synonyms:
SARS-CoV-2 3CLpro Inhibitors 2i | SARS-CoV-2 3CLpro Inhibitors 2j
Type:
Small organic molecule
Emp. Form.:
C28H47N3O5
Mol. Mass.:
505.6899
SMILES:
CCCCCC12CCC(COC(=O)N[C@@H](CC(C)C)C(=O)NC(CC3CCNC3=O)C=O)(CC1)CC2
: