Target
Replicase polyprotein 1ab
Ligand
BDBM476929
Substrate
Meas. Tech.
Enzyme Assays and Inhibition Studies
IC50
49±2.00 nM
Citation
 Dampalla, CSKim, YBickmeier, NRathnayake, ADNguyen, HNZheng, JKashipathy, MMBaird, MABattaile, KPLovell, SPerlman, SChang, KOGroutas, WC Structure-Guided Design of Conformationally Constrained Cyclohexane Inhibitors of Severe Acute Respiratory Syndrome Coronavirus-2 3CL Protease. J Med Chem 64:10047-10058 (2021)  
Target
Name:
Replicase polyprotein 1ab
Synonyms:
2.1.1.- 3.1.-.- 3.4.19.12 3.4.22.69 3.6.4.13 3CL-PRO ExoN Growth factor-like peptide Hel Host translation inhibitor nsp1 NendoU Non-structural protein 2 Non-structural protein 4 Non-structural protein 7 Non-structural protein 9 PL-PRO Pol RNA-directed RNA polymerase Replicase polyprotein 1ab nsp1 nsp12 nsp14 nsp16 nsp3 nsp5 nsp7 nsp9 pp1ab | rep
Type:
PROTEIN
Mol. Mass.:
789589.93
Organism:
Middle East respiratory syndrome-related coronavirus (isolate UnitedKingdom/H123990006/2012) (Betacoronavirus England 1) (Humancoronavirus EMC)
Description:
ChEMBL_117802
Residue:
7078
  
Inhibitor
Name:
BDBM476929
Synonyms:
SARS-CoV-2 3CLpro Inhibitors 3a | SARS-CoV-2 3CLpro Inhibitors 3b
Type:
Small organic molecule
Emp. Form.:
C24H40N3O8S
Mol. Mass.:
530.655
SMILES:
CC(C)C[C@H](NC(=O)OCC1CC2CCCC(C1)C2)C(=O)NC(CC1CCNC1=O)C(O)S([O-])(=O)=O
: