Target
Replicase polyprotein 1ab
Ligand
BDBM12311
Substrate
Meas. Tech.
Literature assay
IC50
5400±1530 nM
Citation
 Vankadara, SWong, YXLiu, BSee, YYTan, LHTan, QWWang, GKaruna, RGuo, XTan, STFong, JYJoy, JChia, CSB A head-to-head comparison of the inhibitory activities of 15 peptidomimetic SARS-CoV-2 3CLpro inhibitors. Bioorg Med Chem Lett 48:128263 (2021)  
Target
Name:
Replicase polyprotein 1ab
Synonyms:
ORF1ab polyprotein pp1ab | rep
Type:
Protein
Mol. Mass.:
794070.71
Organism:
2019-nCoV
Description:
P0DTD1
Residue:
7096
  
Inhibitor
Name:
BDBM12311
Synonyms:
(1R,5S)-N-[3-Amino-1-(cyclobutylmethyl)-2,3-dioxopropyl]-3-[2(S)-[[[(1,1-dimethylethyl)amino]carbonyl]amino]-3,3-dimethyl-1-oxobutyl]-6,6-dimethyl-3-azabicyclo[3.1.0]hexan-2(S)-carboxamide BOCEPREVIR acs.jmedchem.1c00409_ST.355
Type:
Small organic molecule
Emp. Form.:
C27H45N5O5
Mol. Mass.:
519.6767
SMILES:
CC(C)(C)NC(=O)N[C@H](C(=O)N1C[C@H]2[C@@H]([C@H]1C(=O)NC(CC1CCC1)C(=O)C(N)=O)C2(C)C)C(C)(C)C
: