Target
Replicase polyprotein 1ab
Ligand
BDBM476989
Substrate
Meas. Tech.
Literature assay
Ki
53±n/a nM
Citation
 Vankadara, SWong, YXLiu, BSee, YYTan, LHTan, QWWang, GKaruna, RGuo, XTan, STFong, JYJoy, JChia, CSB A head-to-head comparison of the inhibitory activities of 15 peptidomimetic SARS-CoV-2 3CLpro inhibitors. Bioorg Med Chem Lett 48:128263 (2021)  
Target
Name:
Replicase polyprotein 1ab
Synonyms:
3C-like proteinase 3C-like proteinase (SARS-CoV 3Cpro) 3CLp GFL Guanine-N7 methyltransferase Helicase Leader protein Non-structural protein 10 Non-structural protein 3 Non-structural protein 6 Non-structural protein 8 ORF1ab polyprotein PL2-PRO Pol R1AB_SARS RdRp SARS coronavirus main proteinase nsp1 nsp12 nsp14 nsp16 nsp3 nsp5 nsp7 nsp9 pp1ab | rep
Type:
Protein
Mol. Mass.:
790250.81
Organism:
Human SARS coronavirus (SARS-CoV) (Severe acute respiratory syndrome coronavirus)
Description:
P0C6X7
Residue:
7073
  
Inhibitor
Name:
BDBM476989
Synonyms:
TG-0205221
Type:
Small organic molecule
Emp. Form.:
C32H48N4O7
Mol. Mass.:
600.7461
SMILES:
CC(OC(C)(C)C)[C@H](NC(=O)OCc1ccccc1)C(=O)N[C@@H](CC1CCCCC1)C(=O)N[C@@H](CC1CCNC1=O)C=O
: