Target
Vasopressin V2 receptor
Ligand
BDBM301693
Substrate
Meas. Tech.
In Vitro V2 Receptor Assay
EC50
80.0±n/a nM
Citation
 Wisniewski, KSchteingart, CRiviere, P Vasopressin-2 receptor agonists US Patent  US10131692 Publication Date 11/20/2018 
Target
Name:
Vasopressin V2 receptor
Synonyms:
ADHR AVPR2 DIR Renal-type arginine vasopressin receptor V2R_HUMAN Vasopressin V2 receptor | Vasopressin receptor
Type:
Receptor
Mol. Mass.:
40295.28
Organism:
Homo sapiens (Human)
Description:
P30518
Residue:
371
  
Inhibitor
Name:
BDBM301693
Synonyms:
US10131692, Compound 25
Type:
Small organic molecule
Emp. Form.:
C43H62ClN11O9S2
Mol. Mass.:
976.604
SMILES:
CC(C)[C@@H]1NC(=O)[C@H](Cc2cccs2)NC(=O)[C@H](Cc2ccc(Cl)cc2)NC(=O)CCSCC[C@H](NC(=O)[C@H](CC(N)=O)NC1=O)C(=O)N1CCC[C@H]1C(=O)N[C@@H](CO)CCCNC(N)=N
: