Target
Bifunctional phosphoribosylaminoimidazole carboxylase/phosphoribosylaminoimidazole succinocarboxamide synthetase
Ligand
BDBM489195
Substrate
Meas. Tech.
Biochemical Assay
IC50
17.5±n/a nM
Citation
 Osborne, SLarge, J Oxazole derivatives for use in the treatment of cancer US Patent  US10961233 Publication Date 3/30/2021 
Target
Name:
Bifunctional phosphoribosylaminoimidazole carboxylase/phosphoribosylaminoimidazole succinocarboxamide synthetase
Synonyms:
ADE2 Multifunctional protein ADE2 PAIS | PUR6_HUMAN
Type:
Protein
Mol. Mass.:
47081.21
Organism:
Human
Description:
P22234
Residue:
425
  
Inhibitor
Name:
BDBM489195
Synonyms:
US10961233, Example 44
Type:
Small organic molecule
Emp. Form.:
C19H22BrN5O3
Mol. Mass.:
448.314
SMILES:
CN1CC(CN2CCN(CC2=O)c2cccc(Br)c2NC(=O)c2cocn2)C1
: