Target
Bifunctional phosphoribosylaminoimidazole carboxylase/phosphoribosylaminoimidazole succinocarboxamide synthetase
Ligand
BDBM489214
Substrate
Meas. Tech.
Biochemical Assay
IC50
<10±n/a nM
Citation
 Osborne, SLarge, J Oxazole derivatives for use in the treatment of cancer US Patent  US10961233 Publication Date 3/30/2021 
Target
Name:
Bifunctional phosphoribosylaminoimidazole carboxylase/phosphoribosylaminoimidazole succinocarboxamide synthetase
Synonyms:
ADE2 Multifunctional protein ADE2 PAIS | PUR6_HUMAN
Type:
Protein
Mol. Mass.:
47081.21
Organism:
Human
Description:
P22234
Residue:
425
  
Inhibitor
Name:
BDBM489214
Synonyms:
US10961233, Example 69
Type:
Small organic molecule
Emp. Form.:
C19H27BrN6O4S
Mol. Mass.:
515.424
SMILES:
CN(C)CCCS(=O)(=O)N1CCN(CC1)c1ccc(Br)c(NC(=O)c2coc(N)n2)c1
: