Target
Replicase polyprotein 1ab
Ligand
BDBM496920
Substrate
Meas. Tech.
Various Assay
IC50
49730±n/a nM
Citation
 Chia, CSBXu, WNg, PS A patent review on SARS coronavirus main protease (3CLpro) inhibitors. ChemMedChem 0:0 (2021)  
Target
Name:
Replicase polyprotein 1ab
Synonyms:
3C-like proteinase 3C-like proteinase (SARS-CoV 3Cpro) 3CLp GFL Guanine-N7 methyltransferase Helicase Leader protein Non-structural protein 10 Non-structural protein 3 Non-structural protein 6 Non-structural protein 8 ORF1ab polyprotein PL2-PRO Pol R1AB_SARS RdRp SARS coronavirus main proteinase nsp1 nsp12 nsp14 nsp16 nsp3 nsp5 nsp7 nsp9 pp1ab | rep
Type:
Protein
Mol. Mass.:
790250.81
Organism:
Human SARS coronavirus (SARS-CoV) (Severe acute respiratory syndrome coronavirus)
Description:
P0C6X7
Residue:
7073
  
Inhibitor
Name:
BDBM496920
Synonyms:
cmdc.202100576, 12d | quercetin-3-O-d-glucopyranoside
Type:
Small organic molecule
Emp. Form.:
C21H20O12
Mol. Mass.:
464.3763
SMILES:
OC[C@H]1OC(Oc2c(oc3cc(O)cc(O)c3c2=O)-c2ccc(O)c(O)c2)[C@H](O)[C@H](O)[C@H]1O
: