Target
Replicase polyprotein 1ab
Ligand
BDBM496942
Substrate
Meas. Tech.
Various Assay
IC50
100±n/a nM
Citation
 Chia, CSBXu, WNg, PS A patent review on SARS coronavirus main protease (3CLpro) inhibitors. ChemMedChem 0:0 (2021)  
Target
Name:
Replicase polyprotein 1ab
Synonyms:
3C-like proteinase 3C-like proteinase (SARS-CoV 3Cpro) 3CLp GFL Guanine-N7 methyltransferase Helicase Leader protein Non-structural protein 10 Non-structural protein 3 Non-structural protein 6 Non-structural protein 8 ORF1ab polyprotein PL2-PRO Pol R1AB_SARS RdRp SARS coronavirus main proteinase nsp1 nsp12 nsp14 nsp16 nsp3 nsp5 nsp7 nsp9 pp1ab | rep
Type:
Protein
Mol. Mass.:
790250.81
Organism:
Human SARS coronavirus (SARS-CoV) (Severe acute respiratory syndrome coronavirus)
Description:
P0C6X7
Residue:
7073
  
Inhibitor
Name:
BDBM496942
Synonyms:
cmdc.202100576, 18e
Type:
Small organic molecule
Emp. Form.:
C24H25N3O6
Mol. Mass.:
451.4718
SMILES:
O=C[C@H](CC1CCNC1=O)NC(=O)[C@H](Cc1ccccc1)NC(=O)c1ccc2OCOc2c1
: