Target
Acetyl-CoA carboxylase 2
Ligand
BDBM489778
Substrate
Meas. Tech.
In Vitro Acetyl-CoA Carboxylase (ACC) Inhibition Assay
IC50
550±n/a nM
Citation
 Zhang, JLiao, HWang, PWang, P Compounds and their uses as ACC inhibitors US Patent  US10995099 Publication Date 5/4/2021 
Target
Name:
Acetyl-CoA carboxylase 2
Synonyms:
ACACB ACC-beta ACCB Acetyl-CoA carboxylase 2 Acetyl-CoA carboxylase 2 (ACC2)
Type:
Protein
Mol. Mass.:
276535.21
Organism:
Homo sapiens (Human)
Description:
O00763
Residue:
2458
  
Inhibitor
Name:
BDBM489778
Synonyms:
US10995099, Example 22
Type:
Small organic molecule
Emp. Form.:
C27H31N3O8S
Mol. Mass.:
557.615
SMILES:
CNC(=O)c1sc2n(C[C@H](OC3CCOCC3)c3ccccc3OC)c(=O)n(c(=O)c2c1C)C1(CC1)C(O)=O
: