Target
Acetyl-CoA carboxylase 1
Ligand
BDBM496918
Substrate
Meas. Tech.
In Vitro Acetyl-CoA Carboxylase (ACC) Inhibition Assay
IC50
30.0±n/a nM
Citation
 Zhang, JLiao, HWang, PWang, P Compounds and their uses as ACC inhibitors US Patent  US10995099 Publication Date 5/4/2021 
Target
Name:
Acetyl-CoA carboxylase 1
Synonyms:
ACAC ACACA_HUMAN ACC1 Acetyl-CoA carboxylase 1 | Acetyl-CoA carboxylase 1 (ACC1)
Type:
Protein
Mol. Mass.:
265543.22
Organism:
Homo sapiens (Human)
Description:
Q13085
Residue:
2346
  
Inhibitor
Name:
BDBM496918
Synonyms:
US10995099, Example 52
Type:
Small organic molecule
Emp. Form.:
C27H32BrN3O6S
Mol. Mass.:
606.528
SMILES:
CNC(=O)C1(CCC1)n1c(=O)n(CC(OC2CCOCC2)c2ccccc2OC)c2sc(Br)c(C)c2c1=O
: