Target
Thyroid peroxidase
Ligand
BDBM312176
Substrate
Meas. Tech.
Pharmacological Activity Assay
IC50
8900±n/a nM
Citation
 Inghardt, TBJohannesson, PJurva, UMichaelsson, ELindstedt-Alstermark, ETomkinson, NStonehouse, JPGan, L 1-[2-(aminomethyl)benzyl]-2-thioxo-1,2,3,5-tetrahydro-4H-pyrrolo[3,2-d]pyrimidin-4-ones as inhibitors of myeloperoxidase US Patent  US11000525 Publication Date 5/11/2021 
Target
Name:
Thyroid peroxidase
Synonyms:
PERT_HUMAN Thyroid peroxidase | Thyroid peroxidase (TPO)
Type:
Enzyme
Mol. Mass.:
102965.07
Organism:
Homo sapiens (Human)
Description:
P07202
Residue:
933
  
Inhibitor
Name:
BDBM312176
Synonyms:
1-{4-Chloro-2-[1-(methylamino)ethyl]benzyl}-2-thioxo-1,2,3,5-tetrahydro-4H-pyrrolo[3,2-d]pyrimidin-4-one US11000525, Example 5 | US9616063, 5
Type:
Small organic molecule
Emp. Form.:
C16H17ClN4OS
Mol. Mass.:
348.85
SMILES:
CNC(C)c1cc(Cl)ccc1Cn1c2cc[nH]c2c(=O)[nH]c1=S
: